GA43 methyl ester TMS ether

Normal alkane RI, non-polar column, custom temperature program

Data compiled by: NIST Mass Spectrometry Data Center, William E. Wallace, director

Column type CapillaryCapillary
Active phase DB-1BP-1
Column length (m) 25.25.
Carrier gas HeHe
Substrate
Column diameter (mm) 0.320.25
Phase thickness (μm) 0.330.33
Program 50C(1min) => 20C/min => 240C => 4C/min => 295C60C(1min) => 20C/min => 240C => 4C/min => 300C
I 2728.2744.
ReferenceLange, Hedden, et al., 1993Lange, Hedden, et al., 1993, 2
Comment MSDC-RI MSDC-RI

References

Lange, Hedden, et al., 1993
Lange, T.; Hedden, P.; Graebe, J.E., Biosynthesis of 12α- and 13-hydroxylated gibberellins in a cell-free system from Cucurbita maxima endosperm and the identification of new endogenous gibberellins, Planta, 1993, 189, 3, 340-349, https://doi.org/10.1007/BF00194430 . [all data]

Lange, Hedden, et al., 1993, 2
Lange, T.; Hedden, P.; Graebe, J.E., Gibberellin biosynthesis in cell-free extracts from developing Cucurbita maxima embryos and the identification of new endogenous gibberellins, Planta, 1993, 189, 3, 350-358, https://doi.org/10.1007/BF00194431 . [all data]