GA41, MeTMS

Kovats' RI, non-polar column, custom temperature program

View large format table.

Column type Active phase I Reference Comment
CapillaryUltra-22769.Talon M., Koornneef M., et al., 199025. m/0.32 mm/0.52 μm; Program: 50C => 40C/min => 220C => 6C/min => 280C
CapillaryUltra-22769.Talon M., Koornneef M., et al., 199025. m/0.32 mm/0.52 μm; Program: 50C => 40C/min => 220C => 6C/min => 280C

References

Talon M., Koornneef M., et al., 1990
Talon M.; Koornneef M.; Zeevaart J.A.D., Accumulation of C19-gibberelins in the gibbrellin-insensitive dwarf mutant gai if Arabidopsis thaliana (L.) Heynh, Planta, 1990, 182, 4, 501-505, https://doi.org/10.1007/BF02341024 . [all data]