GA3, MeTMSi

Kovats' RI, non-polar column, custom temperature program

View large format table.

Column type Active phase I Reference Comment
CapillaryDB-12689.Nakayama, Yokota, et al., 1996He; Column length: 15. m; Column diameter: 0.258 mm; Program: 130C (2min) => 32C/min => 220C (4min) => 8C/min => 270C (5min)
CapillarySE-52/542750.Croker, Hedden, et al., 199025. m/0.22 mm/0.25 μm, He; Program: 50C(1min) => 15C/min => 240C => 4C/min => 300C
CapillarySE-52/542752.Croker, Hedden, et al., 199025. m/0.22 mm/0.25 μm, He; Program: 50C(1min) => 15C/min => 240C => 4C/min => 300C

Van Den Dool and Kratz RI, non-polar column, custom temperature program

View large format table.

Column type Active phase I Reference Comment
CapillaryCP Sil 5 CB2746.Blake, Taylor, et al., 200225. m/0.25 mm/0.25 μm, He; Program: 60C (1min) => 20C/min => 170C => 4C/min => 290C
CapillaryCP Sil 5 CB2746.Blake, Taylor, et al., 200225. m/0.25 mm/0.25 μm, He; Program: 60C (1min) => 20C/min => 170C => 4C/min => 290C
CapillaryDB-5MS2692.Gutiérrez-Mañero, Ramos-Solano, et al., 200130. m/0.25 mm/0.25 μm, He; Program: 50C(1min) => 30C/min => 240C => 10C/min => 280C
CapillaryDB-5MS2692.Gutiérrez-Mañero, Ramos-Solano, et al., 200130. m/0.25 mm/0.25 μm, He; Program: 50C(1min) => 30C/min => 240C => 10C/min => 280C
CapillaryCP Sil 5 CB2729.Taylor, Blake, et al., 2000He; Column length: 25. m; Column diameter: 0.25 mm; Program: 60C(0.7min) => 20C/min => 220C => 4C/min => 300C
CapillaryCP Sil 5 CB2730.Taylor, Blake, et al., 2000He; Column length: 25. m; Column diameter: 0.25 mm; Program: 60C(0.7min) => 20C/min => 220C => 4C/min => 300C
CapillaryCP Sil 5 CB2729.Taylor, Blake, et al., 2000, 2He; Column length: 25. m; Column diameter: 0.25 mm; Program: 60C(0.7min) => 20C/min => 220C => 4C/min => 300C
CapillaryCP Sil 5 CB2730.Taylor, Blake, et al., 2000, 2He; Column length: 25. m; Column diameter: 0.25 mm; Program: 60C(0.7min) => 20C/min => 220C => 4C/min => 300C
CapillaryOV-12692.Davis, Kobayashi, et al., 199925. m/0.2 mm/0.25 μm, He; Program: 60C(2min) => 10C/min => 150C => 3C/min => 300C(10min)
CapillaryCP-Sil5 CB MS2712.Roberts, Blake, et al., 1999He; Column length: 25. m; Column diameter: 0.25 mm; Program: 90C(1min) => 20C/min => 220C => 4C/min => 290C
CapillaryCP-Sil5 CB MS2713.Roberts, Blake, et al., 1999He; Column length: 25. m; Column diameter: 0.25 mm; Program: 90C(1min) => 20C/min => 220C => 4C/min => 290C
CapillaryOV-12692.Webb, Appleford, et al., 199825. m/0.2 mm/0.25 μm; Program: 60C(2min) => 10C/min => 150C => 3C/min => 300C
CapillaryBP-12699.Webb, Appleford, et al., 199825. m/0.2 mm/0.1 μm; Program: 60C(2min) => 10C/min => 150C => 3C/min => 300C
CapillaryDB-12696.Grünzweig, Rabinowitch, et al., 1997He; Column length: 30. m; Column diameter: 0.25 mm; Program: 40C (2min) => 10C/min => 150C => 3C/min => 300C
CapillaryDB-12696.Grünzweig, Rabinowitch, et al., 1997He; Column length: 30. m; Column diameter: 0.25 mm; Program: 40C (2min) => 10C/min => 150C => 3C/min => 300C
CapillaryBP-12686.MacMillan and Gaskin, 199625. m/0.2 mm/0.1 μm, He; Program: 60C(2min) => 10C/min => 150C => 3C/min => 300C(10min)
CapillaryOV-12697.Spray, Kobayashi, et al., 199625. m/0.2 mm/0.25 μm, He; Program: 60C(2min) => 10min/C => 150C => 3C/min => 300C
CapillaryOV-12692.Santes, Hedden, et al., 199525. m/0.2 mm/0.25 μm; Program: 60C(2min) => 10C/min => 150C => 3C/min => 300C
CapillaryOV-12699.Santes, Hedden, et al., 199525. m/0.2 mm/0.25 μm; Program: 60C(2min) => 10C/min => 150C => 3C/min => 300C
CapillaryCP Sil 5 CB2712.Blake and Browning, 1994He; Column length: 25. m; Column diameter: 0.25 mm; Program: 50C(1min) => 15C/min => 220C => 2C/min => 300C
CapillaryCP Sil 5 CB2713.Blake and Browning, 1994He; Column length: 25. m; Column diameter: 0.25 mm; Program: 50C(1min) => 15C/min => 220C => 2C/min => 300C
CapillaryDB-12700.Pearce, Koshioka, et al., 199415. m/0.22 mm/0.25 μm; Program: 60(0.1 min)-200 0C at 20 deg/min; 200-300 0C at 5 deg/min
CapillarySE-522692.Hedden, Hoad, et al., 199325. m/0.22 mm/0.25 μm, He; Program: 50C => 15C/min => 240C => 4C/min => 300C
CapillarySE-522693.Hedden, Hoad, et al., 199325. m/0.22 mm/0.25 μm, He; Program: 50C => 15C/min => 240C => 4C/min => 300C
CapillaryOV-12692.Waycott, Smith, et al., 199125. m/0.22 mm/0.25 μm; Program: 60C(2min) => 10C/min => 150C => 3C/min => 310C
CapillaryOV-12686.Gaskin, Gilmour, et al., 1984He; Column length: 25. m; Column diameter: 0.2 mm; Program: 60C(2min) => 13C/min => 150C => 3C/min => 280C(10min)

Normal alkane RI, non-polar column, temperature ramp

View large format table.

Column type Active phase I Reference Comment
CapillaryDB-52706.Koshioka, Pharis, et al., 198815. m/0.25 mm/0.25 μm, 25. K/min; Tstart: 60. C; Tend: 250. C
CapillaryDB-52707.Koshioka, Pharis, et al., 198815. m/0.25 mm/0.25 μm, 25. K/min; Tstart: 60. C; Tend: 250. C

Normal alkane RI, non-polar column, custom temperature program

View large format table.

Column type Active phase I Reference Comment
CapillaryDB-12672.Chung, Kuo, et al., 200315. m/0.25 mm/0.25 μm; Program: 60 0C (0.1 min) 20 0C -> 200 0C 5 0C/min -> 300 0C
CapillaryDB-12673.Chung, Kuo, et al., 200315. m/0.25 mm/0.25 μm; Program: 60 0C (0.1 min) 20 0C -> 200 0C 5 0C/min -> 300 0C
CapillaryDB-12695.Yamazaki, Nishijima, et al., 200230. m/0.25 mm/0.25 μm, He; Program: 60C92min) => 30C/min => 210C => 2C/min => 280C(5min)
CapillaryDB-12695.Nakayama, Koshioka, et al., 200130. m/0.25 mm/0.25 μm, He; Program: 60C (2min) => 2C/min => 210C => 2C/min => 280C(5min)
CapillaryHP-12714.Fos, Nuez, et al., 200025. m/0.20 mm/0.33 μm, Helium; Program: 60 0C (1 min) 20 0C/min -> 240 0C 4 0C/min -> 300 0C
CapillaryHP-12714.Fos, Nuez, et al., 200025. m/0.20 mm/0.33 μm, Helium; Program: 60 0C (1 min) 20 0C/min -> 240 0C 4 0C/min -> 300 0C
CapillaryBP-12693.Pérez, Viani, et al., 200025. m/0.2 mm/0.25 μm; Program: 60C (1min) => 20C/min => 240C => 4C/min => 300C
CapillarySE-302694.Wang, Little, et al., 199625. m/0.25 mm/0.25 μm; Program: 60 (2min) => 20C/min => 200C => 4C/min => 260C
CapillarySE-302702.Wang, Little, et al., 199625. m/0.25 mm/0.25 μm; Program: 60 (2min) => 20C/min => 200C => 4C/min => 260C
CapillarySE-302702.Wang, Little, et al., 199625. m/0.25 mm/0.25 μm; Program: 60 (2min) => 20C/min => 200C => 4C/min => 260C
CapillarySE-302702.Wang, Little, et al., 199625. m/0.25 mm/0.25 μm; Program: 60 (2min) => 20C/min => 200C => 4C/min => 260C
CapillaryMethyl Silicone2704.Garcia-Martinez, Santes, et al., 1991Program: not specified
CapillaryMethyl Silicone2704.Garcia-Martinez, Santes, et al., 1991Program: not specified
CapillaryMethyl Silicone2707.Garcia-Martinez, Santes, et al., 1991Program: not specified
CapillaryHP-12691.Matheussen, Morgan, et al., 199112. m/0.2 mm/0.33 μm, He; Program: 60C(1min) => 15C/min => 200C => 5C/min => 270C
CapillaryHP-12702.Matheussen, Morgan, et al., 199112. m/0.2 mm/0.33 μm, He; Program: 60C(1min) => 15C/min => 200C => 5C/min => 270C
CapillaryHP-12708.Matheussen, Morgan, et al., 199112. m/0.2 mm/0.33 μm, He; Program: 60C(1min) => 15C/min => 200C => 5C/min => 270C
CapillaryHP-12713.Matheussen, Morgan, et al., 199112. m/0.2 mm/0.33 μm, He; Program: 60C(1min) => 15C/min => 200C => 5C/min => 270C

References

Nakayama, Yokota, et al., 1996
Nakayama, M.; Yokota, T.; Sohma, R.; Mander, L.N.; Twitchin, B.; Komatsu, H.; Matsui, H.; Bukovac, M.J., Gibberellins in immature seed of Prunus cerasus: structure determination and synthesis of gibberellin, GA95 (1,2-didehydro-GA20), Phytochemistry, 1996, 42, 4, 913-920, https://doi.org/10.1016/0031-9422(96)00035-0 . [all data]

Croker, Hedden, et al., 1990
Croker, S.J.; Hedden, P.; Lenton, J.R.; Stoddart, J.L., Comparison of gibberellins in normal and slender barley seedlings, Plant Physiol., 1990, 94, 1, 194-200, https://doi.org/10.1104/pp.94.1.194 . [all data]

Blake, Taylor, et al., 2002
Blake, P.S.; Taylor, J.M.; Finch-Savage, W.E., Identification of abscisic acid, indole-3-acetic acid, jasmonic acid, indole-3-acetonitrile, methyl jasmonate and gibberellins in developing, dormant and startified seeds of ash (Fraxinus excelsior), Plant Growth Regul., 2002, 37, 2, 119-125, https://doi.org/10.1023/A:1020504610172 . [all data]

Gutiérrez-Mañero, Ramos-Solano, et al., 2001
Gutiérrez-Mañero, F.J.; Ramos-Solano, B.; Probanza, A.; Mehouachi, J.; Tadeo, R.; Talon, M., The plant-growth-promoting rhizobacteria Bacillus pumilus and Baillus licheniformis produce high amounts of physiologically active gibberellins, Physiol. Plant., 2001, 111, 2, 206-211, https://doi.org/10.1034/j.1399-3054.2001.1110211.x . [all data]

Taylor, Blake, et al., 2000
Taylor, D.R.; Blake, P.S.; Crisp, C.M., Identification of gibberellins in leaf exudates of strawberry (Fragaria ananassa Duch.), Plant Growth Regul., 2000, 30, 3, 221-223, https://doi.org/10.1023/A:1006385617161 . [all data]

Taylor, Blake, et al., 2000, 2
Taylor, D.R.; Blake, P.S.; Crisp, C.M., Identification of gibberellins in leaf tissues of day-neutral strawberry (Fragaria × ananassa Duch.) cultivars, Plant Growth Regul., 2000, 30, 1, 5-7, https://doi.org/10.1023/A:1006275024517 . [all data]

Davis, Kobayashi, et al., 1999
Davis, G.; Kobayashi, M.; Phinney, B.O.; Lange, T.; Croker, S.J.; Gaskin, P.; MacMillan, J., Gibberellin biosynthesis in maize. Metabolic studies with GA15, GA24, GA25, GA7, and 2,3-dehydro-GA9, Plant Physiol., 1999, 121, 3, 1037-1045, https://doi.org/10.1104/pp.121.3.1037 . [all data]

Roberts, Blake, et al., 1999
Roberts, A.V.; Blake, P.S.; Lewis, R.; Taylor, J.M.; Dunstan, D.I., The effect of gibberellins on flowering in roses, J. Plant Growth Regul., 1999, 18, 3, 113-119, https://doi.org/10.1007/PL00007058 . [all data]

Webb, Appleford, et al., 1998
Webb, S.E.; Appleford, N.E.J.; Gaskin, P.; Lenton, J.R., Gibberellins in internodes and ears of wheat containing different dwarfing alleles, Phytochemistry, 1998, 47, 5, 671-677, https://doi.org/10.1016/S0031-9422(97)00684-5 . [all data]

Grünzweig, Rabinowitch, et al., 1997
Grünzweig, J.M.; Rabinowitch, H.D.; Katan, J.; Wodner, M.; Ben-Tal, Y., Endogenous gibberellins in foliage of tomato (Lycopersicon esculentum), Phytochemistry, 1997, 46, 5, 811-815, https://doi.org/10.1016/S0031-9422(97)00383-X . [all data]

MacMillan and Gaskin, 1996
MacMillan, J.; Gaskin, P., Gibberellins in endosperm and embryos of Marah macrocarpus, Phytochemistry, 1996, 42, 5, 1263-1266, https://doi.org/10.1016/0031-9422(96)00179-3 . [all data]

Spray, Kobayashi, et al., 1996
Spray, C.R.; Kobayashi, M.; Suzuki, Y.; Phinney, B.O.; Gaskin, P.; MacMillan, J., The dwarf-1 (dl) mutant of Zea mays blocks three steps in the gibberellin-biosynthetic pathway, Proc. Nat. Acad. Sci. U.S.A., 1996, 93, 19, 10515-10518, https://doi.org/10.1073/pnas.93.19.10515 . [all data]

Santes, Hedden, et al., 1995
Santes, C.M.; Hedden, P.; Gaskin, P.; Garcia-Martinez, J.L., Gibberellins and related compounds in young fruits of pea and their relationship to fruit-set, Phytochemistry, 1995, 40, 5, 1347-1355, https://doi.org/10.1016/0031-9422(95)00489-T . [all data]

Blake and Browning, 1994
Blake, P.S.; Browning, G., Gibberellins in developing fruits of Prunus avium, Phytochemistry, 1994, 35, 6, 1383-1386, https://doi.org/10.1016/S0031-9422(00)86860-0 . [all data]

Pearce, Koshioka, et al., 1994
Pearce, D.W.; Koshioka, M.; Pharis, R.P., Chromatography of gibberellins, J. Chromatogr. A, 1994, 658, 1, 91-122, https://doi.org/10.1016/0021-9673(94)85210-3 . [all data]

Hedden, Hoad, et al., 1993
Hedden, P.; Hoad, G.V.; Gaskin, P.; Lewis, M.J.; Green, J.R.; Furber, M.; Mander, L.N., Kaurenoids and gibberellins, including the newly characterized gibberellin A88, in developing apple seeds, Phytochemistry, 1993, 32, 2, 231-237, https://doi.org/10.1016/S0031-9422(00)94973-2 . [all data]

Waycott, Smith, et al., 1991
Waycott, W.; Smith, V.A.; Gaskin, P.; MacMillan, J.; Taiz, L., The endogenous gibberellins of dwarf mutants of lettuce, Plant Physiol., 1991, 95, 4, 1169-1173, https://doi.org/10.1104/pp.95.4.1169 . [all data]

Gaskin, Gilmour, et al., 1984
Gaskin, P.; Gilmour, S.J.; Lenton, J.R.; MacMillan, J.; Sponsel, V.M., Endogenous gibberellins and kauranoids identified from developing and germinating barley grain, J. Plant Growth Regul., 1984, 2, 1-4, 229-242, https://doi.org/10.1007/BF02042252 . [all data]

Koshioka, Pharis, et al., 1988
Koshioka, M.; Pharis, R.P.; Matsuta, N.; Mander, L.N., Metabolism of [3H]gibberellin A5 and [2H]gibberellin A5 in cell suspension cultures of prunus persica, Phytochemistry, 1988, 27, 12, 3799-3805, https://doi.org/10.1016/0031-9422(88)83020-6 . [all data]

Chung, Kuo, et al., 2003
Chung, J.-D.; Kuo, S.-R.; Chien, C.-T., Identification and quantification of gibberellin transformation and dosage changes in good and poor flowering clones of Calocedrus formosana grafts, Taiwan J. For. Sci., 2003, 18, 4, 387-400. [all data]

Yamazaki, Nishijima, et al., 2002
Yamazaki, H.; Nishijima, T.; Koshioka, M.; Miura, H., Gibberellins do no act against abscisic acid in the regulation of bulb dormancy of Allium wakegi Araki, Plant Growth Regul., 2002, 36, 3, 223-229, https://doi.org/10.1023/A:1016577529378 . [all data]

Nakayama, Koshioka, et al., 2001
Nakayama, M.; Koshioka, M.; Matsui, H.; Ohara, H.; Mander, L.N.; Leitch, S.K.; Twitchin, B.; Kraft-Klaunzer, P.; Pharis, R.P.; Yokota, T., Endogenous gibberellins in immature seeds of Prunus persica L.: identification of GA118, GA119, GA120, GA121, GA122 and GA126, Phytochemistry, 2001, 57, 5, 749-758, https://doi.org/10.1016/S0031-9422(01)00154-6 . [all data]

Fos, Nuez, et al., 2000
Fos, M.; Nuez, F.; Garcia-Martinez, J.L., The gene pat-2, which induces natural partenocarpy, alters the gibberellin content in unpollinated tomato ovaries, Plant Physiol., 2000, 122, 2, 471-479, https://doi.org/10.1104/pp.122.2.471 . [all data]

Pérez, Viani, et al., 2000
Pérez, F.J.; Viani, C.; Retamales, J., Bioactive gibberellins in seeded and seedless grapes: identification and changes in content during berry development, Am. J. Enol. Vitic, 2000, 51, 4, 315-318. [all data]

Wang, Little, et al., 1996
Wang, Q.; Little, C.H.A.; Moritz, T.; Odén, P.C., Identification of endogenous gibberellins, and metabolism of tritiated and deuterated GA4, GA9, and GA20, in Scots pine (Pinus sylvestris) shoots, Physiol. Plant., 1996, 97, 4, 764-771, https://doi.org/10.1111/j.1399-3054.1996.tb00542.x . [all data]

Garcia-Martinez, Santes, et al., 1991
Garcia-Martinez, J.L.; Santes, C.; Croker, S.J.; Hedden, P., Identification, quantitation and distribution of gibberellins in fruits of Pisum sativum L. cv. Alaska during pod development, Planta, 1991, 184, 1, 53-60, https://doi.org/10.1007/BF00208236 . [all data]

Matheussen, Morgan, et al., 1991
Matheussen, A.-M.; Morgan, P.W.; Frederiksen, R.A., Implication of gibberellins in head smut (Sporisorium reilianum) of Sorghum bicolor, Plant Physiol., 1991, 96, 2, 537-544, https://doi.org/10.1104/pp.96.2.537 . [all data]