GA25, Me

Normal alkane RI, non-polar column, temperature ramp

Data compiled by: NIST Mass Spectrometry Data Center, William E. Wallace, director

Column type CapillaryCapillary
Active phase DB-1DB-1
Column length (m) 15.15.
Carrier gas
Substrate
Column diameter (mm) 0.2580.258
Phase thickness (μm)
Tstart (C) 160.160.
Tend (C) 280.280.
Heat rate (K/min) 16.16.
Initial hold (min) 2.2.
Final hold (min)
I 2437.2437.
ReferenceOyama, Yamauchi, et al., 1996Oyama, Yamauchi, et al., 1996, 2
Comment MSDC-RI MSDC-RI

References

Oyama, Yamauchi, et al., 1996
Oyama, N.; Yamauchi, T.; Yamane, H.; Yamaguchi, I.; Schraudolf, H.; Mander, L.N.; Murofushi, N., Gibberellins and antheridiogens in prothallia and sporophytes of Anemia phyllitidis, Biosci. Biotechnol. Biochem., 1996, 60, 2, 301-304, https://doi.org/10.1271/bbb.60.301 . [all data]

Oyama, Yamauchi, et al., 1996, 2
Oyama, N.; Yamauchi, T.; Yamane, H.; Murofushi, N.; Agatsuma, M.; Pour, M.; Mander, L.N., Identification of gibberellins and 9,15-cyclogibberellins in developing apple seeds, Biosci. Biotechnol. Biochem., 1996, 60, 2, 305-308, https://doi.org/10.1271/bbb.60.305 . [all data]