ent-7-Hydroxy kaurenoic acid, MeTMSi

Normal alkane RI, non-polar column, custom temperature program

View large format table.

Column type Active phase I Reference Comment
CapillaryBPX-52367.Helliwell, Chandler, et al., 2001
CapillaryBPX-52367.Helliwell, Chandler, et al., 2001Program: 60 0C (1.5 min) 25 K/min -> 150 0C 2 K/min -> 230 0C 70 K/min -> 300 0C

References

Helliwell, Chandler, et al., 2001
Helliwell, C.A.; Chandler, P.M.; Poole, A.; Dennis, E.S.; Peacock, W.J., The CYP88A cytochrome P450, ent-kaurenoic acid oxidase, catalyzes three steps of the gibberellin biosynthesis pathway, Proc. Natl. Acad. Sci. U.S.A, 2001, 98, 4, 2065-2070, https://doi.org/10.1073/pnas.98.4.2065 . [all data]