2-Isobutyl-1,3-oxothiolane

Kovats' RI, non-polar column, isothermal

View large format table.

Column type Active phase Temperature (C) I Reference Comment
CapillaryOV-101130.1079.Misharina and Golovnya, 1994He; Column length: 50. m; Column diameter: 0.32 mm
CapillaryOV-101150.1086.Misharina and Golovnya, 1994He; Column length: 50. m; Column diameter: 0.32 mm
CapillarySE-52130.1105.Misharina and Golovnya, 199460. m/0.32 mm/2. μm, He
CapillarySE-52150.1119.Misharina and Golovnya, 199460. m/0.32 mm/2. μm, He

Van Den Dool and Kratz RI, non-polar column, temperature ramp

View large format table.

Column type Active phase I Reference Comment
CapillaryOV-1011066.Misharina and Golovnya, 1994He, 50. C @ 0. min, 4. K/min; Column length: 50. m; Column diameter: 0.32 mm; Tend: 200. C
CapillarySE-521102.Misharina and Golovnya, 199460. m/0.32 mm/2. μm, He, 50. C @ 0. min, 4. K/min; Tend: 200. C

References

Misharina and Golovnya, 1994
Misharina, T.A.; Golovnya, R.V., Spectral and gas-chromatographic characterization of 4-methyl-2-alkyl substituted 1,3-oxothiolanes and 1,3-dithiolanes, Zh. Anal. Khim., 1994, 49, 4, 395-401. [all data]