Z-9-dodecen-1-ol

Van Den Dool and Kratz RI, non-polar column, temperature ramp

View large format table.

Column type Active phase I Reference Comment
CapillaryDB-51473.Marques, McElfresh, et al., 200030. m/0.25 mm/0.25 μm, 100. C @ 1. min, 5. K/min, 275. C @ 3. min

Van Den Dool and Kratz RI, non-polar column, custom temperature program

View large format table.

Column type Active phase I Reference Comment
CapillaryDB-51473.Sasaerila, Gries, et al., 2000Column length: 30. m; Program: not specified

Van Den Dool and Kratz RI, polar column, temperature ramp

View large format table.

Column type Active phase I Reference Comment
CapillaryDB-Wax2024.Marques, McElfresh, et al., 200030. m/0.32 mm/0.25 μm, 100. C @ 1. min, 5. K/min; Tend: 240. C

Normal alkane RI, polar column, isothermal

View large format table.

Column type Active phase Temperature (C) I Reference Comment
CapillaryPEG160.2055.Guo, Yuan, et al., 1984Column length: 30. m; Column diameter: 0.36 mm
CapillaryFFAP210.2011.Guo, Yuan, et al., 1984Column length: 80. m; Column diameter: 0.30 mm

References

Marques, McElfresh, et al., 2000
Marques, F.A.; McElfresh, J.S.; Millar, J.G., Kováts retention indexes of monounsaturated C12, C14, and C16 alcohols, acetates and aldehydes commonly found in lepidopteran pheromone blends, J. Braz. Chem. Soc., 2000, 11, 6, 592-599, https://doi.org/10.1590/S0103-50532000000600007 . [all data]

Sasaerila, Gries, et al., 2000
Sasaerila, Y.; Gries, R.; Gries, G.; Khaskin, G.; Hardi, Sex pheromone components of nettle caterpillar, Setora nitens, J. Chem. Ecol., 2000, 26, 8, 1983-1990, https://doi.org/10.1023/A:1005513211225 . [all data]

Guo, Yuan, et al., 1984
Guo, G.; Yuan, M.; Lin, G., Study on the resolution of geometric isomers of insect sex pheromones with capillary column GC, You ji hua xue, 1984, 5, 349-354. [all data]