2-Keto-octanoic acid, methyl ester

Van Den Dool and Kratz RI, non-polar column, temperature ramp

View large format table.

Column type Active phase I Reference Comment
PackedSE-301200.van den Dool and Kratz, 1963Celite; Tstart: 75. C; Tend: 228. C

Normal alkane RI, non-polar column, temperature ramp

View large format table.

Column type Active phase I Reference Comment
CapillaryOV-1011195.Bauer, Neupert, et al., 198480. C @ 5. min, 2. K/min; Column length: 25. m; Tend: 280. C

References

van den Dool and Kratz, 1963
van den Dool, H.; Kratz, P. Dec., A generalization of the retention index system including linear temperature programmed gas-liquid partition chromatography, J. Chromatogr., 1963, 11, 463-471, https://doi.org/10.1016/S0021-9673(01)80947-X . [all data]

Bauer, Neupert, et al., 1984
Bauer, S.; Neupert, M.; Spiteller, G., Characterization of artefacts produced by treatment of organic acids with diazomethane, J. Chromatogr., 1984, 309, 243-259, https://doi.org/10.1016/0378-4347(84)80032-8 . [all data]