(E)-4-Decen-1-ol

Normal alkane RI, non-polar column, temperature ramp

View large format table.

Column type Active phase I Reference Comment
CapillaryOV-1011241.Tamura, Kihara, et al., 1990Nitrogen, 2. K/min; Column length: 50. m; Column diameter: 0.25 mm; Tstart: 80. C; Tend: 200. C

Normal alkane RI, polar column, temperature ramp

View large format table.

Column type Active phase I Reference Comment
CapillaryCarbowax 20M1791.Tamura, Kihara, et al., 1990Nitrogen, 2. K/min; Column length: 50. m; Column diameter: 0.25 mm; Tstart: 80. C; Tend: 180. C

References

Tamura, Kihara, et al., 1990
Tamura, H.; Kihara, S.; Sugisawa, H., A New Identification Method for Aliphatic Compounds Using Linear Equation of the GC Retention Index Value, Agric. Biol. Chem., 1990, 54, 12, 3171-3176, https://doi.org/10.1271/bbb1961.54.3171 . [all data]