1,10,13-Hexadecatriene, 7,8-epoxy

Normal alkane RI, non-polar column, temperature ramp

View large format table.

Column type Active phase I Reference Comment
CapillaryDB-11721.Binder and French, 19944. K/min, 230. C @ 10. min; Column length: 60. m; Column diameter: 0.32 mm; Tstart: 50. C

Normal alkane RI, polar column, temperature ramp

View large format table.

Column type Active phase I Reference Comment
CapillaryDB-Wax2128.Binder and French, 19944. K/min, 230. C @ 10. min; Column length: 60. m; Column diameter: 0.32 mm; Tstart: 50. C

References

Binder and French, 1994
Binder, R.G.; French, R.C., Volatile components of Canada thistle, J. Agric. Food Chem., 1994, 42, 12, 2942-2945, https://doi.org/10.1021/jf00048a056 . [all data]