Phenanthrene, 2,4-difluoro

Normal alkane RI, non-polar column, temperature ramp

View large format table.

Column type Active phase I Reference Comment
CapillaryPB-11688.Andersson and Weis, 199450. m/0.32 mm/0.2 μm, H2, 80. C @ 2. min, 4. K/min, 270. C @ 5. min
CapillaryDB-51687.Andersson and Weis, 199430. m/0.32 mm/0.25 μm, H2, 80. C @ 2. min, 4. K/min, 270. C @ 5. min

Lee's RI, non-polar column, temperature ramp

View large format table.

Column type Active phase I Reference Comment
CapillaryPB-1290.51Andersson and Weis, 199450. m/0.32 mm/0.2 μm, H2, 80. C @ 2. min, 4. K/min, 270. C @ 5. min
CapillaryDB-5290.23Andersson and Weis, 199430. m/0.32 mm/0.25 μm, H2, 80. C @ 2. min, 4. K/min, 270. C @ 5. min

Lee's RI, polar column, temperature ramp

View large format table.

Column type Active phase I Reference Comment
CapillaryDB-Wax282.97Andersson and Weis, 199430. m/0.2 mm/0.15 μm, H2, 80. C @ 2. min, 4. K/min, 270. C @ 5. min

References

Andersson and Weis, 1994
Andersson, J.T.; Weis, U., Gas Chromatographic Determination of Polycyclic Aromatic Compounds with Fluorinated Analogues as Internal Standards, J. Chromatogr. A, 1994, 659, 1, 151-161, https://doi.org/10.1016/0021-9673(94)85017-8 . [all data]