4-Hepten-2-ol, (Z)-, acetate

Normal alkane RI, non-polar column, temperature ramp

Data compiled by: NIST Mass Spectrometry Data Center, William E. Wallace, director

Column type CapillaryCapillaryCapillaryCapillary
Active phase DB-1DB-1DB-1DB-1
Column length (m) 30.30.30.30.
Carrier gas HeHeHeHe
Substrate
Column diameter (mm) 0.250.250.250.25
Phase thickness (μm) 0.250.250.250.25
Tstart (C) 50.50.50.50.
Tend (C) 240.240.240.240.
Heat rate (K/min) 5.5.3.3.
Initial hold (min) 3.3.5.5.
Final hold (min)
I 1022.1024.1023.1023.
ReferenceShiota, 1993Shiota, 1993Shiota, 1993Shiota, 1993
Comment MSDC-RI MSDC-RI MSDC-RI MSDC-RI

References

Shiota, 1993
Shiota, H., New esteric components in the volatiles of banana fruit (Musa sapientum L.), J. Agric. Food Chem., 1993, 41, 11, 2056-2062, https://doi.org/10.1021/jf00035a046 . [all data]