2,4-octadienal

Van Den Dool and Kratz RI, non-polar column, custom temperature program

Data compiled by: NIST Mass Spectrometry Data Center, William E. Wallace, director

Column type CapillaryCapillaryCapillary
Active phase DB-5MSDB-5BPX-5
Column length (m) 30.50.50.
Carrier gas HeHeHe
Substrate
Column diameter (mm) 0.250.320.32
Phase thickness (μm) 0.250.50.5
Program 35C => 120C/min => 60C1.5C/min => 100C => 5C/min => 280CoC(5min) => 60C/min => 60C (5min) => 4C/min => 250C0C (10min) => 40C/min => 40C (2min) => 4C/min => 280C
I 1116.1125.1130.
ReferenceTurchini, Giani, et al., 2004Parker, Hassell, et al., 2000Elmore, Mottram, et al., 1997
Comment MSDC-RI MSDC-RI MSDC-RI

References

Turchini, Giani, et al., 2004
Turchini, G.M.; Giani, I.; Caprino, F.; Moretti, V.M.; Valfrè, F., Discrimination of origin of farmed trout by means of biometrical parameters, fillet composition and flavor volatile compounds, Ital. J. Anim. Sci., 2004, 3, 123-140. [all data]

Parker, Hassell, et al., 2000
Parker, J.K.; Hassell, G.M.E.; Mottram, D.S.; Guy, R.C.E., Sensory and instrumental analyses of volatiles generated during the extrusion cooking of oat flours, J. Agric. Food Chem., 2000, 48, 8, 3497-3506, https://doi.org/10.1021/jf991302r . [all data]

Elmore, Mottram, et al., 1997
Elmore, J.S.; Mottram, D.S.; Enser, M.; Wood, J.D., Novel thiazoles and 3-thiazolines in cooked beef aroma, J. Agric. Food Chem., 1997, 45, 9, 3603-3607, https://doi.org/10.1021/jf970066m . [all data]