Propanoic acid, 3-[N-(2-formyl-5-(hydroxymethyl)-1-pyrrolyl)]

Normal alkane RI, non-polar column, temperature ramp

View large format table.

Column type Active phase I Reference Comment
CapillaryDB-11700.Nishibori and Bernhard, 199330. m/0.25 mm/0.25 μm, He, 50. C @ 8. min, 4. K/min; Tend: 250. C

References

Nishibori and Bernhard, 1993
Nishibori, S.; Bernhard, R.A., Model system for cookies: Volatile components formed from the reaction of sugar and β-alanine, J. Agric. Food Chem., 1993, 41, 12, 2374-2377, https://doi.org/10.1021/jf00036a030 . [all data]