1,4-Anhydrolyxitol, TMS

Van Den Dool and Kratz RI, non-polar column, custom temperature program

View large format table.

Column type Active phase I Reference Comment
CapillaryHP-51600.Madaj, Wisniewski, et al., 1993H2; Column length: 50. m; Column diameter: 0.20 mm; Program: 115 0C 3 0C/min -> 180 0C 4 0C/min -> 250 0C

References

Madaj, Wisniewski, et al., 1993
Madaj, J.; Wisniewski, A.; Skorupowa, E.; Sokolowski, J., Capillary gas chromatographic separations of a multicomponent mixture of polyalcohol compounds, J. Chromatogr. A, 1993, 655, 2, 267-273, https://doi.org/10.1016/0021-9673(93)83232-H . [all data]