9,11-Eremophiladien-8-one

Normal alkane RI, non-polar column, custom temperature program

View large format table.

Column type Active phase I Reference Comment
CapillaryDB-11740.Ishihara, Tsuneya, et al., 1993Program: not specified

References

Ishihara, Tsuneya, et al., 1993
Ishihara, M.; Tsuneya, T.; Uneyama, K., Components of the Volatile Concentrate of Agarwood, J. Essent. Oil Res., 1993, 5, 3, 283-289, https://doi.org/10.1080/10412905.1993.9698221 . [all data]