Benzene, 3-ethylpentyl

Normal alkane RI, non-polar column, custom temperature program

View large format table.

Column type Active phase I Reference Comment
CapillaryDB-11306.Hathcock and Bertsch, 1993100. m/0.25 mm/0.5 μm; Program: not specified

References

Hathcock and Bertsch, 1993
Hathcock, S.; Bertsch, W., Analysis of volatiles associated with industrial scale processing of expanded polystyrene. Part II: Identification and quantitation, J. Hi. Res. Chromatogr., 1993, 16, 11, 651-659, https://doi.org/10.1002/jhrc.1240161106 . [all data]