1H-Indene, 1-phenylmethyl

Normal alkane RI, non-polar column, custom temperature program

Data compiled by: NIST Mass Spectrometry Data Center, William E. Wallace, director

Column type Capillary
Active phase DB-1
Column length (m) 100.
Carrier gas
Substrate
Column diameter (mm) 0.25
Phase thickness (μm) 0.5
Program not specified
I 1892.
ReferenceHathcock and Bertsch, 1993
Comment MSDC-RI

References

Hathcock and Bertsch, 1993
Hathcock, S.; Bertsch, W., Analysis of volatiles associated with industrial scale processing of expanded polystyrene. Part II: Identification and quantitation, J. Hi. Res. Chromatogr., 1993, 16, 11, 651-659, https://doi.org/10.1002/jhrc.1240161106 . [all data]