Allitol, TMS

Van Den Dool and Kratz RI, non-polar column, custom temperature program

Data compiled by: NIST Mass Spectrometry Data Center, William E. Wallace, director

Column type Capillary
Active phase HP-5
Column length (m) 50.
Carrier gas H2
Substrate
Column diameter (mm) 0.20
Phase thickness (μm)
Program 115 0C 3 0C/min -> 180 0C 4 0C/min -> 250 0C
I 1988.
ReferenceMadaj, Wisniewski, et al., 1993
Comment MSDC-RI

References

Madaj, Wisniewski, et al., 1993
Madaj, J.; Wisniewski, A.; Skorupowa, E.; Sokolowski, J., Capillary gas chromatographic separations of a multicomponent mixture of polyalcohol compounds, J. Chromatogr. A, 1993, 655, 2, 267-273, https://doi.org/10.1016/0021-9673(93)83232-H . [all data]