1-Phytene

Normal alkane RI, non-polar column, custom temperature program

Data compiled by: NIST Mass Spectrometry Data Center, William E. Wallace, director

Column type CapillaryCapillaryCapillaryCapillary
Active phase HP-5DB-5 MSSE-54SE-54
Column length (m) 30.30.50.50.
Carrier gas HeliumHeliumHe
Substrate
Column diameter (mm) 0.320.320.320.32
Phase thickness (μm) 0.251.0
Program 60 0C (3 min) 10 0C/min -> 280 0C (1 min) 3 0C/min -> 320 0C (20 min)-10 0C (3 min) 50 0C/min -> 40 0C 5 0C/min -> 290 0C (5 min)35 0C (5 min) 8 0C/min -> 200 0C 2 0C/min -> 250 0C35C(5min) => 8C/min => 200C => 2C/min => 250C
I 1790.1785.1776.1795.
ReferencePovolo, Pelizzola, et al., 2009Watanabe, Ueda, et al., 2008Um, Bailey, et al., 1992Suzuki and Bailey, 1985
Comment MSDC-RI MSDC-RI MSDC-RI MSDC-RI

References

Povolo, Pelizzola, et al., 2009
Povolo, M.; Pelizzola, V.; Ravera, D.; Contarini, G., Significance of the nonvolatile minor compounds of the neutral lipid fraction as markers of the origin of dairy products, J. Agric. Food Chem., 2009, 57, 16, 7387-7394, https://doi.org/10.1021/jf8040353 . [all data]

Watanabe, Ueda, et al., 2008
Watanabe, A.; Ueda, Y.; Higuchi, M.; Shiba, N., Analysis of volatile compounds in beef fat by dinamic-headspace solid phase microextraction combined with gas chromatography - mass spectrometry, J. Food Sci., 2008, 73, 5, 420-425, https://doi.org/10.1111/j.1750-3841.2008.00764.x . [all data]

Um, Bailey, et al., 1992
Um, K.W.; Bailey, M.E.; Clarke, A.D.; Chao, R.R., Concentration and identification of volatile compounds from heated beef fat using supercritical CO2 extraction-gas liquid chromatography/mass spectrometry, J. Agric. Food Chem., 1992, 40, 9, 1641-1646, https://doi.org/10.1021/jf00021a033 . [all data]

Suzuki and Bailey, 1985
Suzuki, J.; Bailey, M.E., Direct sampling capillary GLC analysis of flavor volatiles from ovine fat, J. Agric. Food Chem., 1985, 33, 3, 343-347, https://doi.org/10.1021/jf00063a006 . [all data]