Erythronic acid, tetrakis-TMS

Kovats' RI, non-polar column, isothermal

View large format table.

Column type Active phase Temperature (C) I Reference Comment
PackedOV-1160.1581.Petersson, 1977N2, Chromosorb G (100-120 mesh); Column length: 2. m

Van Den Dool and Kratz RI, non-polar column, temperature ramp

View large format table.

Column type Active phase I Reference Comment
CapillaryUltra-21567.Tuchman, Bowers, et al., 198425. m/0.31 mm/0.52 μm, He, 5. K/min; Tstart: 50. C; Tend: 300. C

Normal alkane RI, non-polar column, temperature ramp

View large format table.

Column type Active phase I Reference Comment
CapillaryHP-51569.Isidorov, Lech, et al., 200830. m/0.25 mm/0.25 μm, Helium, 3. K/min, 300. C @ 30. min; Tstart: 50. C

Normal alkane RI, non-polar column, custom temperature program

View large format table.

Column type Active phase I Reference Comment
CapillaryHP-51567.Isidorov, Lech, et al., 200830. m/0.25 mm/0.25 μm, Helium; Program: not specified

References

Petersson, 1977
Petersson, G., Retention Data in GLC Analysis; Carbohydrate-Related Hydroxy Carboxylic and Dicarboxylic Acids as Trimethylsilyl Derivatives, J. Chromatogr. Sci., 1977, 15, 7, 245-255, https://doi.org/10.1093/chromsci/15.7.245 . [all data]

Tuchman, Bowers, et al., 1984
Tuchman, M.; Bowers, L.D.; Fregien, K.D.; Crippin, P.J.; Krivit, W., Capillary Gas Chromatographic Separation of Urinary Organic Acids. Retention Indices of 101 Urinary Acids on a 5% Phenylmethyl Silicone Capillary Column, J. Chromatogr. Sci., 1984, 22, 5, 198-202, https://doi.org/10.1093/chromsci/22.5.198 . [all data]

Isidorov, Lech, et al., 2008
Isidorov, V.A.; Lech, P.; Zolciak, A.; Rusak, N.; Szczepaniak, L., Gas Chromatographic - nass spectrometric investigation of metabolites from the needles and roots of pine seedlings at early stages of pathogenic fungi Armillaria ostoyae attack, Trees, 2008, 22, 4, 531-542, https://doi.org/10.1007/s00468-008-0213-z . [all data]