1,3-Dioxolane, 4-methyl-2-(1-methylpropyl), cis

Kovats' RI, non-polar column, isothermal

View large format table.

Column type Active phase Temperature (C) I Reference Comment
CapillaryOV-101110.942.Misharina, Golovnya, et al., 199250. m/0.32 mm/0.5 μm, He
CapillaryOV-101130.948.Misharina, Golovnya, et al., 199250. m/0.32 mm/0.5 μm, He

Van Den Dool and Kratz RI, non-polar column, temperature ramp

View large format table.

Column type Active phase I Reference Comment
CapillaryOV-101939.Misharina, Golovnya, et al., 199250. m/0.32 mm/0.5 μm, He, 4. K/min; Tstart: 50. C; Tend: 200. C

References

Misharina, Golovnya, et al., 1992
Misharina, T.A.; Golovnya, R.V.; Yakovleva, V.N., GC-MS and GC-FTIR characteristics of 2-alkyl- and 4-methyl-2-alkyl-1,3-dioxolans, Zh. Anal. Khim., 1992, 47, 304-311. [all data]