3-formyl-2-methylthiophene

Kovats' RI, non-polar column, isothermal

Data compiled by: NIST Mass Spectrometry Data Center, William E. Wallace, director

Column type Capillary
Active phase SPB-1
Column length (m) 60.
Carrier gas
Substrate
Column diameter (mm) 0.32
Phase thickness (μm) 0.25
Temperature (C) 100.
I 1091.
ReferenceMisharina, Beletsky, et al., 1994
Comment MSDC-RI

References

Misharina, Beletsky, et al., 1994
Misharina, T.A.; Beletsky, I.V.; Golovnya, R.V., Chromatographic and IR characteristics of methyl-, formyl-, and acetyl-substituted furans and thiophenes, Russ. Chem. Bull. (Engl. Transl.), 1994, 43, 1, 64-69, https://doi.org/10.1007/BF00699137 . [all data]