3-methyl-1,2,4-trithiolane

Van Den Dool and Kratz RI, non-polar column, temperature ramp

Data compiled by: NIST Mass Spectrometry Data Center, William E. Wallace, director

Column type CapillaryCapillaryCapillary
Active phase BPX-5HP-1HP-1
Column length (m) 50.50.50.
Carrier gas  HeHe
Substrate
Column diameter (mm) 0.320.320.32
Phase thickness (μm) 0.51.051.05
Tstart (C) 60.40.40.
Tend (C) 250.260.260.
Heat rate (K/min) 4.2.2.
Initial hold (min) 5.
Final hold (min) 20.
I 1158.1115.1121.
ReferenceBredie, Mottram, et al., 2002Kuo and Ho, 1992Kuo and Ho, 1992, 2
Comment MSDC-RI MSDC-RI MSDC-RI

References

Bredie, Mottram, et al., 2002
Bredie, W.L.P.; Mottram, D.S.; Guy, R.C.E., Effect of temperature and pH on the generation of flavor volatiles in extrusion cooking of wheat flour, J. Agric. Food Chem., 2002, 50, 5, 1118-1125, https://doi.org/10.1021/jf0111662 . [all data]

Kuo and Ho, 1992
Kuo, M.-C.; Ho, C.-T., Volatile constituents of the distilled oils of Welsh onions (Allium fistulosum L. variety Maichuon) and scallions (Allium fistulosum L. variety Caespitosum), J. Agric. Food Chem., 1992, 40, 1, 111-117, https://doi.org/10.1021/jf00013a021 . [all data]

Kuo and Ho, 1992, 2
Kuo, M.-C.; Ho, C.-T., Volatile constituents of the solvent extracts of Welsh onions (Allium fistulosum L. variety Maichuon) and scallions (A. fistulosum L. variety caepitosum), J. Agric. Food Chem., 1992, 40, 10, 1906-1910, https://doi.org/10.1021/jf00022a036 . [all data]