Thr isoBOC TBDMS #1

Normal alkane RI, non-polar column, temperature ramp

View large format table.

Column type Active phase I Reference Comment
CapillaryDB-51887.Kim, Kim, et al., 199230. m/0.25 mm/0.24 μm, 150. C @ 2. min, 3. K/min; Tend: 280. C

References

Kim, Kim, et al., 1992
Kim, K.-R.; Kim, J.-H.; Oh, C.-H.; Mabry, T.J., Capillary gas chromatography of protein amino acids as N(O,S)-isobutyloxycarbonyl tert.-butyldimethylsilyl derivatives in aqueous samples, J. Chromatogr., 1992, 605, 2, 241-249, https://doi.org/10.1016/0021-9673(92)85242-L . [all data]