Pro isoBOC TBDMS

Normal alkane RI, non-polar column, temperature ramp

View large format table.

Column type Active phase I Reference Comment
CapillaryDB-51918.Oh, Kim, et al., 199430. m/0.25 mm/0.25 μm, 150. C @ 2. min, 3. K/min; Tend: 280. C
CapillaryDB-51918.Kim, Kim, et al., 199230. m/0.25 mm/0.24 μm, 150. C @ 2. min, 3. K/min; Tend: 280. C

References

Oh, Kim, et al., 1994
Oh, C.-H.; Kim, J.-H.; Kim, K.-R.; Brownson, D.M.; Mabry, T.J., Simultaneous gas chromatographic analysis of non-protein and protein amino acids as N(O,S)-isobutyloxycarbonyl tert.-butyldimethylsilyl derivatives, J. Chromatogr. A, 1994, 669, 1-2, 125-137, https://doi.org/10.1016/0021-9673(94)80344-7 . [all data]

Kim, Kim, et al., 1992
Kim, K.-R.; Kim, J.-H.; Oh, C.-H.; Mabry, T.J., Capillary gas chromatography of protein amino acids as N(O,S)-isobutyloxycarbonyl tert.-butyldimethylsilyl derivatives in aqueous samples, J. Chromatogr., 1992, 605, 2, 241-249, https://doi.org/10.1016/0021-9673(92)85242-L . [all data]