Pyridine, 4-methyl-2-(1-methylethyl)

Normal alkane RI, non-polar column, temperature ramp

View large format table.

Column type Active phase I Reference Comment
CapillaryDB-11033.Ishihara, Tsuneya, et al., 199260. m/0.25 mm/0.25 μm, He, 50. C @ 5. min, 3. K/min; Tend: 240. C
CapillaryDB-11035.Ishihara, Tsuneya, et al., 199260. m/0.25 mm/0.25 μm, He, 50. C @ 5. min, 3. K/min; Tend: 240. C

References

Ishihara, Tsuneya, et al., 1992
Ishihara, M.; Tsuneya, T.; Shiga, M.; Kawashima, S.; Yamagishi, K.; Yoshida, F.; Sato, H.; Uneyama, K., New pyridine derivatives and basic components in spearmint oil (Mentha gentilis f. cardiaca) and peppermint oil (Mentha piperita), J. Agric. Food Chem., 1992, 40, 9, 1647-1655, https://doi.org/10.1021/jf00021a034 . [all data]