Furan-2-carboxaldehyde, 3-methyl

Van Den Dool and Kratz RI, non-polar column, temperature ramp

Data compiled by: NIST Mass Spectrometry Data Center, William E. Wallace, director

Column type CapillaryCapillary
Active phase DB-5OV-101
Column length (m) 30.60.
Carrier gas  He
Substrate
Column diameter (mm) 0.320.25
Phase thickness (μm) 1.0.50
Tstart (C) 60.50.
Tend (C) 250.200.
Heat rate (K/min) 4.4.
Initial hold (min) 5.
Final hold (min) 20.
I 920.935.
ReferenceMadruga and Mottram, 1998Golovnya, Misharina, et al., 1992
Comment MSDC-RI MSDC-RI

Van Den Dool and Kratz RI, polar column, temperature ramp

Data compiled by: NIST Mass Spectrometry Data Center, William E. Wallace, director

Column type Capillary
Active phase Carbowax 40M
Column length (m) 50.
Carrier gas He
Substrate
Column diameter (mm) 0.32
Phase thickness (μm) 0.25
Tstart (C) 50.
Tend (C) 200.
Heat rate (K/min) 4.
Initial hold (min)
Final hold (min)
I 1565.
ReferenceGolovnya, Misharina, et al., 1992
Comment MSDC-RI

References

Madruga and Mottram, 1998
Madruga, M.S.; Mottram, D.S., The effect of pH on the formation of volatile compounds produced by heating a model system containing 5'-imp and cysteine, J. Braz. Chem. Soc., 1998, 9, 3, 261-271, https://doi.org/10.1590/S0103-50531998000300010 . [all data]

Golovnya, Misharina, et al., 1992
Golovnya, R.V.; Misharina, T.A.; Beletskiy, I.V., Influence of methyl, formyl and acetyl groups on retention of substituted furans and thiophenes in capillary GC, Chromatographia, 1992, 34, 9/10, 497-501, https://doi.org/10.1007/BF02290243 . [all data]