Furan-2-carboxaldehyde, 3,5-dimethyl

Kovats' RI, non-polar column, isothermal

View large format table.

Column type Active phase Temperature (C) I Reference Comment
CapillarySE-30100.1021.Golovnya, Misharina, et al., 199260. m/0.25 mm/0.50 μm, He
CapillaryOV-101100.1021.Golovnya, Misharina, et al., 199260. m/0.25 mm/0.50 μm, He

Kovats' RI, polar column, isothermal

View large format table.

Column type Active phase Temperature (C) I Reference Comment
CapillaryCarbowax 40M100.1660.Golovnya, Misharina, et al., 199250. m/0.32 mm/0.25 μm, He

Van Den Dool and Kratz RI, non-polar column, temperature ramp

View large format table.

Column type Active phase I Reference Comment
CapillaryOV-1011019.Golovnya, Misharina, et al., 199260. m/0.25 mm/0.50 μm, He, 4. K/min; Tstart: 50. C; Tend: 200. C

Van Den Dool and Kratz RI, polar column, temperature ramp

View large format table.

Column type Active phase I Reference Comment
CapillaryCarbowax 40M1664.Golovnya, Misharina, et al., 199250. m/0.32 mm/0.25 μm, He, 4. K/min; Tstart: 50. C; Tend: 200. C

References

Golovnya, Misharina, et al., 1992
Golovnya, R.V.; Misharina, T.A.; Beletskiy, I.V., Influence of methyl, formyl and acetyl groups on retention of substituted furans and thiophenes in capillary GC, Chromatographia, 1992, 34, 9/10, 497-501, https://doi.org/10.1007/BF02290243 . [all data]