Phenanthrene, 1,10-dimethyl

Lee's RI, non-polar column, temperature ramp

Data compiled by: NIST Mass Spectrometry Data Center, William E. Wallace, director

Column type Capillary
Active phase CP Sil 8 CB
Column length (m) 50.
Carrier gas H2
Substrate
Column diameter (mm) 0.22
Phase thickness (μm) 0.13
Tstart (C) 120.
Tend (C) 270.
Heat rate (K/min) 3.
Initial hold (min) 2.
Final hold (min)
I 349.97
ReferenceGarrigues, Parlanti, et al., 1987
Comment MSDC-RI

References

Garrigues, Parlanti, et al., 1987
Garrigues, P.; Parlanti, E.; Radke, M.; Bellocq, J.; Willsch, H.; Ewald, M., Identification of alkylphenanthrenes in shale oil and coal by liquid and capillary gas chromatography and high-resolution spectrofluorimetry (Shpol'skii effect), J. Chromatogr., 1987, 395, 217-228, https://doi.org/10.1016/S0021-9673(01)94112-3 . [all data]