1-Pyrroline, 2-hexanoyl

Normal alkane RI, non-polar column, temperature ramp

View large format table.

Column type Active phase I Reference Comment
PackedSE-541319.Schieberle, 1991Chromosorb G AW DMCS (100-120 mesh), 50. C @ 2. min, 6. K/min, 230. C @ 10. min; Column length: 3. m

References

Schieberle, 1991
Schieberle, P., Primary odorants in popcorn, J. Agric. Food Chem., 1991, 39, 6, 1141-1144, https://doi.org/10.1021/jf00006a030 . [all data]