Oxetane, 3-bromomethyl-3-[2-methyl-1-(3-methylphenyloxy)propyl]

Kovats' RI, non-polar column, isothermal

View large format table.

Column type Active phase Temperature (C) I Reference Comment
PackedSE-30125.1943.Casteignau and Halary, 1972Chromosorb P (60-80 mesh); Column length: 3. m

References

Casteignau and Halary, 1972
Casteignau, G.; Halary, J.-L., No. 72 - Identification et dosage par chromatographie en phase gazeuse d'oxetannes disubstitués en 3 et de quelques autres éthers-oxydes, Bull. Soc. Chim. Fr., 1972, 1, 420-428. [all data]