Quinazolin-4-one, 2-pentyl, 3-methyl

Kovats' RI, non-polar column, isothermal

View large format table.

Column type Active phase Temperature (C) I Reference Comment
PackedOV-1220.2050.Papp, Szász, et al., 1991

Normal alkane RI, non-polar column, custom temperature program

View large format table.

Column type Active phase I Reference Comment
CapillaryOV-12050.Zhang, Li, et al., 2003Program: not specified

References

Papp, Szász, et al., 1991
Papp, O.; Szász, Gy.; Orfi, L.; Hermecz, I., Correlation between structure and gas chromatographic behaviour of nitrogen-containing heterocyclic compounds. II. Alkyl substitution of quinazolone derivatives, J. Chromatogr., 1991, 537, 371-376, https://doi.org/10.1016/S0021-9673(01)88910-X . [all data]

Zhang, Li, et al., 2003
Zhang, X.; Li, J.; Cao, W., Quantitative structure-retention relationship for quinazoline derivatives, J. Beijing Inst. Chem. Technol., 2003, 30, 5, 101-104. [all data]