epi-Catalponol

Normal alkane RI, non-polar column, temperature ramp

View large format table.

Column type Active phase I Reference Comment
CapillaryHP-5 MS1988.Pripdeevech and Saansoomchai, 201330. m/0.25 mm/0.25 μm, Helium, 3. K/min; Tstart: 60. C; Tend: 230. C

References

Pripdeevech and Saansoomchai, 2013
Pripdeevech, P.; Saansoomchai, J., Antibacterial activity and chemical composition of essential oil and various extracts of Fagraea fragrans Roxb. flowers, Chiang Mai J. Sci., 2013, 40, 2, 214-223. [all data]