Benzo[2,3]phenanthro[4,5]thiophene, 5-methyl

Lee's RI, non-polar column, temperature ramp

Data compiled by: NIST Mass Spectrometry Data Center, William E. Wallace, director

Column type Capillary
Active phase Rxi-5 MS
Column length (m) 30.
Carrier gas Helium
Substrate
Column diameter (mm) 0.25
Phase thickness (μm) 0.25
Tstart (C) 60.
Tend (C) 340.
Heat rate (K/min) 5.
Initial hold (min) 1.
Final hold (min) 0.
I 458.80
ReferenceZeigler, Schantz, et al., 2012
Comment MSDC-RI

References

Zeigler, Schantz, et al., 2012
Zeigler, C.; Schantz, M.; Wise, S.; Robbat, A., Mass spectra and retention indices for polycyclic aromatic sulfur heterocycles and some alkylated analogs, Polycyclic Aromatic Compounds, 2012, 32, 2, 154-176, https://doi.org/10.1080/10406638.2011.651679 . [all data]