4-Fluoro-1,2-dimethylbenzene

Normal alkane RI, polar column, temperature ramp

View large format table.

Column type Active phase I Reference Comment
CapillaryAT-Wax2211.Kiss, Csoka, et al., 201160. m/0.25 mm/0.25 μm, Helium, 4. K/min; Tstart: 60. C; Tend: 280. C

References

Kiss, Csoka, et al., 2011
Kiss, M.; Csoka, M.; Gyorfi, J.; Korany, K., Comparison of the fragrance constituents of Tuber aestivium and Tuber Brumale gathered in Hungary, J. Appl. Botany Food Quality, 2011, 84, 102-110. [all data]