1-(8-Bromo-2,3,6,7-tetrahydrodibenzo[1,2-b; 4,5-b']difuran-4-yl-2-aminoethane, TFA

Normal alkane RI, non-polar column, temperature ramp

Data compiled by: NIST Mass Spectrometry Data Center, William E. Wallace, director

Column type CapillaryCapillary
Active phase DB-1 MSDB-5 MS
Column length (m) 30.30.
Carrier gas HeliumHelium
Substrate
Column diameter (mm) 0.250.25
Phase thickness (μm) 0.250.25
Tstart (C) 80.80.
Tend (C) 320.320.
Heat rate (K/min) 15.15.
Initial hold (min) 1.1.
Final hold (min)
I 2257.2309.
ReferenceZaitsu, Katagi, et al., 2010Zaitsu, Katagi, et al., 2010
Comment MSDC-RI MSDC-RI

References

Zaitsu, Katagi, et al., 2010
Zaitsu, K.; Katagi, M.; Kamata, H.; Nakanishi, K.; Shima, N.; Komata, T.; Nishioka, H.; Miki, A.; Tatsuma, M.; Tsuchihashi, H., Simultaneous analysis of six novel hallucinogenic (tetrahydrobenzodifuranyl) aminoalkanes (FLYs) and (benzodifuranyl) aminoalkanes (DragonFLYs) by GC-MS, LC-MS, and LC-MS-MS, Forensic Toxicol., 2010, 28, 1, 9-18, https://doi.org/10.1007/s11419-009-0083-0 . [all data]