2-Methylthieno[2,3-b]thiophene

Normal alkane RI, non-polar column, custom temperature program

Data compiled by: NIST Mass Spectrometry Data Center, William E. Wallace, director

Column type Capillary
Active phase Polydimethyl siloxane
Column length (m)
Carrier gas
Substrate
Column diameter (mm)
Phase thickness (μm)
Program 40 0C 20 0C/min -> 60 0C (5 min) 4 0C/min -> 250 0C
I 1306.
ReferenceXu, He, et al., 2010
Comment MSDC-RI

References

Xu, He, et al., 2010
Xu, H.; He, W.; Liu, X.; Gao, Y., Effect of pressure on the Maillard reaction between ribose and cysteine in supercritical carbon dioxide, Czech J. Food Sci., 2010, 28, 3, 192-201. [all data]