2,3-Dihydro-6-methylthieno[2,3-c]furan

Normal alkane RI, non-polar column, custom temperature program

View large format table.

Column type Active phase I Reference Comment
CapillaryPolydimethyl siloxane1197.Xu, He, et al., 2010Program: 40 0C 20 0C/min -> 60 0C (5 min) 4 0C/min -> 250 0C

References

Xu, He, et al., 2010
Xu, H.; He, W.; Liu, X.; Gao, Y., Effect of pressure on the Maillard reaction between ribose and cysteine in supercritical carbon dioxide, Czech J. Food Sci., 2010, 28, 3, 192-201. [all data]