Ornitine, TMS

Normal alkane RI, non-polar column, temperature ramp

View large format table.

Column type Active phase I Reference Comment
CapillaryDB-5 MS1825.Yan, A., et al., 200910. m/0.18 mm/0.18 μm, Helium, 70. C @ 2. min, 35. K/min, 310. C @ 2. min

References

Yan, A., et al., 2009
Yan, B.; A.; Wang, G.; Lu, H.; Huang, X.; Liu, Y.; Zha, W.; Hao, H.; Zhang, Y.; Liu, L.; Gu, S.; Huang, Q.; Zheng, Y.; Sun, J., Metabolomic investigation into variation of endogenous metabolites in professional athletes subject to strength-endurance training, J. Appl. Physiol., 2009, 106, 2, 531-538, https://doi.org/10.1152/japplphysiol.90816.2008 . [all data]