β-D-Methylglucopyranoside, TMS

Normal alkane RI, non-polar column, temperature ramp

Data compiled by: NIST Mass Spectrometry Data Center, William E. Wallace, director

Column type Capillary
Active phase DB-5 MS
Column length (m) 10.
Carrier gas Helium
Substrate
Column diameter (mm) 0.18
Phase thickness (μm) 0.18
Tstart (C) 70.
Tend (C) 310.
Heat rate (K/min) 35.
Initial hold (min) 2.
Final hold (min) 2.
I 2056.
ReferenceYan, A., et al., 2009
Comment MSDC-RI

References

Yan, A., et al., 2009
Yan, B.; A.; Wang, G.; Lu, H.; Huang, X.; Liu, Y.; Zha, W.; Hao, H.; Zhang, Y.; Liu, L.; Gu, S.; Huang, Q.; Zheng, Y.; Sun, J., Metabolomic investigation into variation of endogenous metabolites in professional athletes subject to strength-endurance training, J. Appl. Physiol., 2009, 106, 2, 531-538, https://doi.org/10.1152/japplphysiol.90816.2008 . [all data]