Fentanyl, 4-N-(4-pentenyl) analogue

Normal alkane RI, non-polar column, isothermal

View large format table.

Column type Active phase Temperature (C) I Reference Comment
CapillaryBP-5220.2346.Manral, Gupta, et al., 200825. m/0.22 mm/0.25 μm, Nitrogen
CapillaryBP-5250.2356.Manral, Gupta, et al., 200825. m/0.22 mm/0.25 μm, Nitrogen

Normal alkane RI, non-polar column, temperature ramp

View large format table.

Column type Active phase I Reference Comment
CapillaryBP-52359.Manral, Gupta, et al., 200825. m/0.22 mm/0.25 μm, Nitrogen, 20. K/min; Tstart: 100. C; Tend: 250. C
CapillaryBP-52363.Manral, Gupta, et al., 200825. m/0.22 mm/0.25 μm, Nitrogen, 20. K/min; Tstart: 100. C; Tend: 250. C
CapillaryBP-52365.Manral, Gupta, et al., 200825. m/0.22 mm/0.25 μm, Nitrogen, 20. K/min; Tstart: 100. C; Tend: 250. C
CapillaryBP-52368.Manral, Gupta, et al., 200825. m/0.22 mm/0.25 μm, Nitrogen, 20. K/min; Tstart: 100. C; Tend: 250. C
CapillaryBP-52364.Manral, Gupta, et al., 200825. m/0.22 mm/0.25 μm, Nitrogen, 30. K/min; Tstart: 100. C; Tend: 250. C
CapillaryBP-52365.Manral, Gupta, et al., 200825. m/0.22 mm/0.25 μm, Nitrogen, 40. K/min; Tstart: 100. C; Tend: 250. C
CapillaryBP-52367.Manral, Gupta, et al., 200825. m/0.22 mm/0.25 μm, Nitrogen, 50. K/min; Tstart: 100. C; Tend: 250. C

References

Manral, Gupta, et al., 2008
Manral, L.; Gupta, P.K.; Ganesan, K.; Malhotra, R.C., Gas chromatographic retention indices of fentanyl and its analogues, J. Chromatogr. Sci., 2008, 46, 7, 551-555, https://doi.org/10.1093/chromsci/46.6.551 . [all data]