N,N-di-(1-Phenylethyl)amine, diastereomer # 1

Normal alkane RI, non-polar column, temperature ramp

View large format table.

Column type Active phase I Reference Comment
CapillaryHP Ultra-11638.King, Poortman-van der Meer, et al., 199612. m/0.22 mm/0.25 μm, Helium, 10. K/min, 280. C @ 10. min; Tstart: 100. C

References

King, Poortman-van der Meer, et al., 1996
King, L.A.; Poortman-van der Meer, A.J.; Huizer, H., 1-Phenylethylamines: a new series of illicit drugs?, Forensic Sci. International, 1996, 77, 3, 141-149, https://doi.org/10.1016/0379-0738(95)01852-2 . [all data]