Formamide, N,N-di-(1-phenylethyl), diastereomer # 1

Normal alkane RI, non-polar column, temperature ramp

Data compiled by: NIST Mass Spectrometry Data Center, William E. Wallace, director

Column type Capillary
Active phase HP Ultra-1
Column length (m) 12.
Carrier gas Helium
Substrate
Column diameter (mm) 0.22
Phase thickness (μm) 0.25
Tstart (C) 100.
Tend (C) 280.
Heat rate (K/min) 10.
Initial hold (min)
Final hold (min) 10.
I 2042.
ReferenceKing, Poortman-van der Meer, et al., 1996
Comment MSDC-RI

References

King, Poortman-van der Meer, et al., 1996
King, L.A.; Poortman-van der Meer, A.J.; Huizer, H., 1-Phenylethylamines: a new series of illicit drugs?, Forensic Sci. International, 1996, 77, 3, 141-149, https://doi.org/10.1016/0379-0738(95)01852-2 . [all data]