4-(3-Hydroxy-3-methylpent-4-enyl)-4a,8,8-trimethyl-3-methylidene-5,6,7,8a-tetrahydro-4H-naphthalen-1-one (Laricsone)

Normal alkane RI, non-polar column, custom temperature program

Data compiled by: NIST Mass Spectrometry Data Center, William E. Wallace, director

Column type Capillary
Active phase TR-5 MS
Column length (m) 15.
Carrier gas Helium
Substrate
Column diameter (mm) 0.25
Phase thickness (μm) 0.25
Program 35 0C (3 min) 2 0C/min -> 60 0C (3 min) 2 0C/min -> 80 0C (3 min) 4 0C/min -> 120 0C (3 min) 5 0C/min -> 150 0C (3 mion) 15 0C/min -> 240 0C (10 min)
I 2189.
ReferenceKurashov, Krylova, et al., 2013
Comment MSDC-RI

References

Kurashov, Krylova, et al., 2013
Kurashov, E.A.; Krylova, Yu.V.; Mitrukova, G.G., Variations in component composition of essential oil of Potamogeton pusillus (Potamogetonaceae) dirong vegetation, Plant Resources (Rastitel'nye Resursy), 2013, 000-000. [all data]