1H-Cyclopenta[b]pyridino-3-carbonitrile, 4,5,6,7-tetrahydro-2-methylthio-4-spirocyclohexane

Normal alkane RI, non-polar column, temperature ramp

View large format table.

Column type Active phase I Reference Comment
CapillaryHP-5 MS1337.Xu, Han, et al., 201230. m/0.25 mm/0.25 μm, 60. C @ 2. min, 15. K/min, 300. C @ 10. min

References

Xu, Han, et al., 2012
Xu, L.-L.; Han, T.; Wu, J.-Z.; Zhang, Q.-Y.; Zhang, H.; Huang, B.-K.; Rahman, K., Comparative research of chemical constituents, antifungal and antitumor properties of ether extracts of Panax ginseng and its endophytic fungus, 2012, retrieved from http://www.thefreelibrary.com/Comparative .... [all data]