4(Z),8(Z)-Matricaria lactone

Normal alkane RI, non-polar column, custom temperature program

View large format table.

Column type Active phase I Reference Comment
CapillaryHP-51560.Veres, Csupor-Loffler, et al., 201230. m/0.35 mm/0.25 μm, Nitrogen; Program: 60 0C 3 0C/min -> 210 0C 5 0C/min -> 250 0C (2 min)

References

Veres, Csupor-Loffler, et al., 2012
Veres, K.; Csupor-Loffler, B.; Lazar, A.; Holmann, J., Antifungal activity and composition of essential oils of Conyza canadensis herbs and roots, The Sci. World. J., 2012, 2012, 1-5, https://doi.org/10.1100/2012/489646 . [all data]