cis,trans,cis-1,2,4-Trimethylcyclopentane

Normal alkane RI, non-polar column, temperature ramp

Data compiled by: NIST Mass Spectrometry Data Center, William E. Wallace, director

Column type Capillary
Active phase Petrocol DH
Column length (m) 100.
Carrier gas Helium
Substrate
Column diameter (mm) 0.25
Phase thickness (μm) 0.50
Tstart (C) 20.
Tend (C) 220.
Heat rate (K/min) 15.
Initial hold (min) 15.
Final hold (min) 30.
I 738.
ReferenceSupelco, 2012
Comment MSDC-RI

References

Supelco, 2012
Supelco, CatalogNo. 24160-U, Petrocol DH Columns. Catalog No. 24160-U, 2012, retrieved from http://www.sigmaaldrich.com/etc/medialib/docs/Supelco/Datasheet/1/w97949.Par.0001.File.tmp/w97949.pdf. [all data]