Dihydrochamazulene 1

Normal alkane RI, non-polar column, custom temperature program

View large format table.

Column type Active phase I Reference Comment
CapillaryHP-5 MS1514.Sharopov, Sulaimonova, et al., 201230. m/0.25 mm/0.25 μm, Helium; Program: 40 0C (10 min) 3 0C/min -> 200 0C 2 0C/min -> 220 0C

References

Sharopov, Sulaimonova, et al., 2012
Sharopov, F.S.; Sulaimonova, V.A.; Setzer, W.N., Composition of the essential oil of Ertemisia absinthium from Tajikistan, Rec. Nat. Prod., 2012, 6, 2, 127-134. [all data]