2-Acetyl-4-methylthiazole

Normal alkane RI, polar column, temperature ramp

Data compiled by: NIST Mass Spectrometry Data Center, William E. Wallace, director

Column type Capillary
Active phase HP-Innowax
Column length (m) 15.
Carrier gas Helium
Substrate
Column diameter (mm) 0.32
Phase thickness (μm) 0.50
Tstart (C) 40.
Tend (C) 250.
Heat rate (K/min) 3.
Initial hold (min)
Final hold (min)
I 1668.
ReferencePuvipirom and Chaisei, 2012
Comment MSDC-RI

References

Puvipirom and Chaisei, 2012
Puvipirom, J.; Chaisei, S., Contribution of roasted grains and seeds in aroma of oleang (Thai coffee drink), Int. Food Res. J., 2012, 19, 2, 583-588. [all data]